Target
Mitogen-activated protein kinase kinase kinase kinase 1
Ligand
BDBM548860
Substrate
Meas. Tech.
HPK1-SLP76 TR-FRET ASSAY
IC50
0.02±n/a nM
Citation
 A., CDL., CJAnthony, DXavier, FH., FPShuhei, KBing, LJongwon, LPing, LL., MJG., NAAlexander, PA., VBC., YE 7-PHENYL SUBSTITUTED 2-AMINOQUINAZOLINE INHIBITORS OF HPK1 WIPO 0:0 (2022) Target
Name:
Mitogen-activated protein kinase kinase kinase kinase 1
Synonyms:
HPK1 MAP4K1
Type:
PROTEIN
Mol. Mass.:
91316.07
Organism:
Homo sapiens (Human)
Description:
ChEMBL_586597
Residue:
833
  
Inhibitor
Name:
BDBM548860
Synonyms:
WO2022098806, Compound 2-121
Type:
Small organic molecule
Emp. Form.:
C27H26FN7O
Mol. Mass.:
483.54
SMILES:
CN1C2CCC1c1cc(Nc3ncc4c(N)c(F)c(cc4n3)-c3cnc4OCCNc4c3C)ccc21
: