Target
Lethal factor
Ligand
BDBM8493
Substrate
Peptide Substrate
Meas. Tech.
Fluorescence Resonance Energy Transfer Assay (FRET)
IC50
810±n/a nM
Citation
 Xiong, YWiltsie, JWoods, AGuo, JPivnichny, JVTang, WBansal, ACummings, RTCunningham, BRFriedlander, AMDouglas, CMSalowe, SPZaller, DMScolnick, EMSchmatz, DMBartizal, KHermes, JDMacCoss, MChapman, KT The discovery of a potent and selective lethal factor inhibitor for adjunct therapy of anthrax infection. Bioorg Med Chem Lett 16:964-8 (2006)  
Target
Name:
Lethal factor
Synonyms:
Anthrax Lethal Factor (LF) Antrax lethal toxin lef | lethal factor
Type:
PROTEIN
Mol. Mass.:
93758.56
Organism:
Bacillus anthracis
Description:
ChEMBL_1460338
Residue:
809
  
Inhibitor
Name:
BDBM8493
Synonyms:
(2R)-N-hydroxy-3-methyl-2-{[5-(1,2,3-thiadiazol-5-yl)thiophene-2-]sulfonamido}butanamide | hydroxamate analogue 30
Type:
Small organic molecule
Emp. Form.:
C11H14N4O4S3
Mol. Mass.:
362.448
SMILES:
CC(C)[C@@H](NS(=O)(=O)c1ccc(s1)-c1cnns1)C(=O)NO
:
Substrate
Name:
Peptide Substrate
Synonyms:
(Cou)Consensus(K(QSY-35)GG)-NH2
Type:
Peptide
Mol. Mass.:
9139.37
Organism:
Description:
Residue:
78