Target
Interferon-induced, double-stranded RNA-activated protein kinase
Ligand
BDBM308061
Substrate
Meas. Tech.
PDGFRβ Kinase Assay
Ki
10000±n/a nM
Citation
 Boral, SMalone, TCWang, SRao, SYang, R Heterocycle-substituted pyridyl benzothiophenes as kinase inhibitors US Patent  US9650366 Publication Date 5/16/2017 
Target
Name:
Interferon-induced, double-stranded RNA-activated protein kinase
Synonyms:
E2AK2_HUMAN Eukaryotic translation initiation factor 2-alpha kinase 2 P1/eIF-2A protein kinase PRKR Protein kinase RNA-activated eIF-2A protein kinase 2 | p68 kinase
Type:
PROTEIN
Mol. Mass.:
62104.61
Organism:
Homo sapiens (Human)
Description:
ChEMBL_1467743
Residue:
551
  
Inhibitor
Name:
BDBM308061
Synonyms:
US10011593, Ex. 12 | US9650366, 12
Type:
Small organic molecule
Emp. Form.:
C25H19F4N7O2
Mol. Mass.:
525.4577
SMILES:
OCCCn1nnc(n1)-c1cncc(c1)C#Cc1ccc(NC(=O)Nc2cc(ccc2F)C(F)(F)F)cc1
: