Target
Tyrosine-protein kinase receptor TYRO3
Ligand
BDBM308369
Substrate
Meas. Tech.
Activity Assay
IC50
24.0±n/a nM
Citation
 Wang, XZhang, WFrye, S Therapeutic uses of selected pyrimidine compounds with anti-Mer tyrosine kinase activity US Patent  US9649309 Publication Date 5/16/2017 
Target
Name:
Tyrosine-protein kinase receptor TYRO3
Synonyms:
BYK RSE TIF TYRO3_HUMAN | Tyrosine-protein kinase SKY
Type:
Protein
Mol. Mass.:
96894.13
Organism:
Homo sapiens (Human)
Description:
Q06418
Residue:
890
  
Inhibitor
Name:
BDBM308369
Synonyms:
US9649309, Compound UNC4358A
Type:
Small organic molecule
Emp. Form.:
C27H40N6O
Mol. Mass.:
464.6461
SMILES:
CCCCNc1ncc(c(N[C@H]2CC[C@H](O)CC2)n1)-c1ccc(cn1)C1=CCN(CC1)C(C)C
: