Target
Carboxylic ester hydrolase
Ligand
BDBM8966
Substrate
BDBM8978
Meas. Tech.
Measurement of FBSAChE/EqBuChE Inhibitory Activity
Ki
0.94±n/a nM
Citation
 Campiani, GFattorusso, CButini, SGaeta, AAgnusdei, MGemma, SPersico, MCatalanotti, BSavini, LNacci, VNovellino, EHolloway, HWGreig, NHBelinskaya, TFedorko, JMSaxena, A Development of molecular probes for the identification of extra interaction sites in the mid-gorge and peripheral sites of butyrylcholinesterase (BuChE). Rational design of novel, selective, and highly potent BuChE inhibitors. J Med Chem 48:1919-29 (2005)  
Target
Name:
Carboxylic ester hydrolase
Synonyms:
BuChE Butyrylcholine esterase Butyrylcholinesterase (BChE) Butyrylcholinesterase (EqBuChE) butyrylcholinesterase precursor
Type:
Protein
Mol. Mass.:
68842.83
Organism:
Equus caballus (Horse)
Description:
Q9N1N9
Residue:
602
  
Inhibitor
Name:
BDBM8966
Synonyms:
N,N-Bis[3-[(1,2,3,4-tetrahydroacridin-9-yl)amino]propyl]-N-ethylamine ethylbis[3-(1,2,3,4-tetrahydroacridin-9-ylamino)propyl]amine
Type:
Small organic molecule
Emp. Form.:
C34H43N5
Mol. Mass.:
521.7387
SMILES:
CCN(CCCNc1c2CCCCc2nc2ccccc12)CCCNc1c2CCCCc2nc2ccccc12
:
Substrate
Name:
BDBM8978
Synonyms:
(Propylcarbonylthioethyl)trimethylammonium iodide CHEMBL148530 butyrylthiocholine | butyrylthiocholine chloride
Type:
Small organic molecule
Emp. Form.:
C9H20NOS
Mol. Mass.:
190.326
SMILES:
CCCC(=O)SCC[N+](C)(C)C
: