Target
Acetylcholinesterase
Ligand
BDBM9022
Substrate
BDBM8959
Meas. Tech.
In Vitro Enzyme Inhibition Assay
pH
8±n/a
Temperature
303.15±n/a K
IC50
0.02±n/a nM
Citation
 Munoz-Ruiz, PRubio, LGarcia-Palomero, EDorronsoro, Idel Monte-Millan, MValenzuela, RUsan, Pde Austria, CBartolini, MAndrisano, VBidon-Chanal, AOrozco, MLuque, FJMedina, MMartinez, A Design, synthesis, and biological evaluation of dual binding site acetylcholinesterase inhibitors: new disease-modifying agents for Alzheimer's disease. J Med Chem 48:7223-33 (2005)  
Target
Name:
Acetylcholinesterase
Synonyms:
ACES_BOVIN Acetylcholinesterase (AChE) | Acetylcholinesterase precursor
Type:
Enzyme
Mol. Mass.:
67659.62
Organism:
Bos taurus (bovine)
Description:
Residue:
613
  
Inhibitor
Name:
BDBM9022
Synonyms:
CHEMBL225567 N-[5-(6-Chloro-1,2,3,4-tetrahydroacridin-9-ylamino)-hexyl]-3-(1H-indol-3-yl)propionamide | N-{6-[(6-chloro-1,2,3,4-tetrahydroacridin-9-yl)amino]hexyl}-3-(1H-indol-3-yl)propanamide
Type:
Small organic molecule
Emp. Form.:
C30H35ClN4O
Mol. Mass.:
503.078
SMILES:
Clc1ccc2c(NCCCCCCNC(=O)CCc3c[nH]c4ccccc34)c3CCCCc3nc2c1
:
Substrate
Name:
BDBM8959
Synonyms:
(2-Mercaptoethyl)trimethylammonium iodide acetate Acetylthiocholine acetylthiocholine chloride | acetylthiocholine iodide
Type:
Small organic molecule
Emp. Form.:
C7H16NOS
Mol. Mass.:
162.272
SMILES:
CC(=O)SCC[N+](C)(C)C
: