Target
Cholinesterase
Ligand
BDBM9036
Substrate
BDBM8978
Meas. Tech.
In Vitro Enzyme Inhibition Assay
IC50
1.7±n/a nM
Citation
 Munoz-Ruiz, PRubio, LGarcia-Palomero, EDorronsoro, Idel Monte-Millan, MValenzuela, RUsan, Pde Austria, CBartolini, MAndrisano, VBidon-Chanal, AOrozco, MLuque, FJMedina, MMartinez, A Design, synthesis, and biological evaluation of dual binding site acetylcholinesterase inhibitors: new disease-modifying agents for Alzheimer's disease. J Med Chem 48:7223-33 (2005)  
Target
Name:
Cholinesterase
Synonyms:
Acylcholine acylhydrolase Butyrylcholine esterase (BChE) Butyrylcholinesterase (BuChE) CHLE_HUMAN Cholinesterases Pseudocholinesterase
Type:
Homotetramer
Mol. Mass.:
68422.27
Organism:
Homo sapiens (Human)
Description:
P06276
Residue:
602
  
Inhibitor
Name:
BDBM9036
Synonyms:
2-(5-Bromo-1H-indol-3-yl)-N-[7-(6-chloro-1,2,3,4-tetrahydroacridin-9-ylamino)heptyl]acetamide Indole-Tacrine Heterodimer 19
Type:
Small organic molecule
Emp. Form.:
C30H34BrClN4O
Mol. Mass.:
581.974
SMILES:
Clc1ccc2c(NCCCCCCCNC(=O)Cc3c[nH]c4ccc(Br)cc34)c3CCCCc3nc2c1
:
Substrate
Name:
BDBM8978
Synonyms:
(Propylcarbonylthioethyl)trimethylammonium iodide CHEMBL148530 butyrylthiocholine | butyrylthiocholine chloride
Type:
Small organic molecule
Emp. Form.:
C9H20NOS
Mol. Mass.:
190.326
SMILES:
CCCC(=O)SCC[N+](C)(C)C
: