Target
Cholinesterase
Ligand
BDBM9042
Substrate
BDBM8978
Meas. Tech.
In Vitro Enzyme Inhibition Assay
IC50
60±n/a nM
Citation
 Munoz-Ruiz, PRubio, LGarcia-Palomero, EDorronsoro, Idel Monte-Millan, MValenzuela, RUsan, Pde Austria, CBartolini, MAndrisano, VBidon-Chanal, AOrozco, MLuque, FJMedina, MMartinez, A Design, synthesis, and biological evaluation of dual binding site acetylcholinesterase inhibitors: new disease-modifying agents for Alzheimer's disease. J Med Chem 48:7223-33 (2005)  
Target
Name:
Cholinesterase
Synonyms:
Acylcholine acylhydrolase Butyrylcholine esterase (BChE) Butyrylcholinesterase (BuChE) CHLE_HUMAN Cholinesterases Pseudocholinesterase
Type:
Homotetramer
Mol. Mass.:
68422.27
Organism:
Homo sapiens (Human)
Description:
P06276
Residue:
602
  
Inhibitor
Name:
BDBM9042
Synonyms:
2-(1H-indol-3-yl)ethyl N-{6-[(6-chloro-1,2,3,4-tetrahydroacridin-9-yl)amino]hexyl}carbamate [6-(6-Chloro-1,2,3,4-tetrahydroacridin-9-ylamino)hexyl]-carbamic Acid 2-(1H-Indol-3-yl)ethyl Ester
Type:
Small organic molecule
Emp. Form.:
C30H35ClN4O2
Mol. Mass.:
519.078
SMILES:
Clc1ccc2c(NCCCCCCNC(=O)OCCc3c[nH]c4ccccc34)c3CCCCc3nc2c1
:
Substrate
Name:
BDBM8978
Synonyms:
(Propylcarbonylthioethyl)trimethylammonium iodide CHEMBL148530 butyrylthiocholine | butyrylthiocholine chloride
Type:
Small organic molecule
Emp. Form.:
C9H20NOS
Mol. Mass.:
190.326
SMILES:
CCCC(=O)SCC[N+](C)(C)C
: