Target
Acetylcholinesterase
Ligand
BDBM9061
Substrate
BDBM8959
Meas. Tech.
Enzyme Inhibition Assay
pH
7.4±n/a
Temperature
310.15±n/a K
IC50
333±39 nM
Citation
 Hu, MKWu, LJHsiao, GYen, MH Homodimeric tacrine congeners as acetylcholinesterase inhibitors. J Med Chem 45:2277-82 (2002)  
Target
Name:
Acetylcholinesterase
Synonyms:
ACES_RAT Acetylcholinesterase and butyrylcholinesterase (AChE and BChE) Acetylcholinesterase, AChE | Ache
Type:
Enzyme
Mol. Mass.:
68193.62
Organism:
Rattus norvegicus (rat)
Description:
P37136
Residue:
614
  
Inhibitor
Name:
BDBM9061
Synonyms:
Homodimeric Tacrine Analog 4c N-(8-{6H,7H,8H,9H,10H-cyclohepta[b]quinolin-11-ylamino}octyl)-6H,7H,8H,9H,10H-cyclohepta[b]quinolin-11-amine
Type:
Small organic molecule
Emp. Form.:
C36H46N4
Mol. Mass.:
534.7772
SMILES:
C(CCCCNc1c2CCCCCc2nc2ccccc12)CCCNc1c2CCCCCc2nc2ccccc12
:
Substrate
Name:
BDBM8959
Synonyms:
(2-Mercaptoethyl)trimethylammonium iodide acetate Acetylthiocholine acetylthiocholine chloride | acetylthiocholine iodide
Type:
Small organic molecule
Emp. Form.:
C7H16NOS
Mol. Mass.:
162.272
SMILES:
CC(=O)SCC[N+](C)(C)C
: