Target
Cholinesterase
Ligand
BDBM9045
Substrate
BDBM8978
Meas. Tech.
Enzyme Inhibition Assay
IC50
328±n/a nM
Citation
 Hu, MKWu, LJHsiao, GYen, MH Homodimeric tacrine congeners as acetylcholinesterase inhibitors. J Med Chem 45:2277-82 (2002)  
Target
Name:
Cholinesterase
Synonyms:
Acylcholine acylhydrolase Butyrylcholine esterase (BChE) Butyrylcholinesterase (BuChE) CHLE_HUMAN Cholinesterases Pseudocholinesterase
Type:
Homotetramer
Mol. Mass.:
68422.27
Organism:
Homo sapiens (Human)
Description:
P06276
Residue:
602
  
Inhibitor
Name:
BDBM9045
Synonyms:
Homodimeric Tacrine Analog 2b N-(7-{1H,2H,3H-cyclopenta[b]quinolin-9-ylamino}heptyl)-1H,2H,3H-cyclopenta[b]quinolin-9-amine
Type:
Small organic molecule
Emp. Form.:
C31H36N4
Mol. Mass.:
464.6443
SMILES:
C(CCCNc1c2CCCc2nc2ccccc12)CCCNc1c2CCCc2nc2ccccc12
:
Substrate
Name:
BDBM8978
Synonyms:
(Propylcarbonylthioethyl)trimethylammonium iodide CHEMBL148530 butyrylthiocholine | butyrylthiocholine chloride
Type:
Small organic molecule
Emp. Form.:
C9H20NOS
Mol. Mass.:
190.326
SMILES:
CCCC(=O)SCC[N+](C)(C)C
: