Target
Dimer of Gag-Pol polyprotein [501-599,Q508K,L534I,L564I,C568A,C596A]
Ligand
BDBM9229
Substrate
HIV Protease substrate
Meas. Tech.
Protease Inhibition Assay
pH
6.4±n/a
Temperature
298.15±n/a K
Ki
0.8±n/a nM
Citation
 Spaltenstein, AAlmond, MRBock, WJCleary, DGFurfine, ESHazen, RJKazmierski, WMSalituro, FGTung, RDWright, LL Novel inhibitors of HIV protease: design, synthesis and biological evaluation of picomolar inhibitors containing cyclic P1/P2 scaffolds. Bioorg Med Chem Lett 10:1159-62 (2000)  
Target
Name:
Dimer of Gag-Pol polyprotein [501-599,Q508K,L534I,L564I,C568A,C596A]
Synonyms:
HIV-1 Protease
Type:
Protein Complex
Mol. Mass.:
Description:
Components:
This complex has 2 components.
Component 1
Name:
Gag-Pol polyprotein [501-599,Q508K,L534I,L564I,C568A,C596A]
Synonyms:
HIV-1 Protease chain A gag-pol
Type:
Enzyme Subunit
Mol. Mass.:
10732.11
Organism:
Human immunodeficiency virus type 1
Description:
The HIV-1 protease (Genbank HIVHXB2CG) clone was constructed with the substitutions Q7K, L33I, and L63I, to minimize the autoproteolysis of the protease, and C67A and C95A, to prevent cysteine-thiol oxidation.
Residue:
99
  
Component 2
Name:
Gag-Pol polyprotein [501-599,Q508K,L534I,L564I,C568A,C596A]
Synonyms:
HIV-1 Protease chain A gag-pol
Type:
Enzyme Subunit
Mol. Mass.:
10732.11
Organism:
Human immunodeficiency virus type 1
Description:
The HIV-1 protease (Genbank HIVHXB2CG) clone was constructed with the substitutions Q7K, L33I, and L63I, to minimize the autoproteolysis of the protease, and C67A and C95A, to prevent cysteine-thiol oxidation.
Residue:
99
  
Inhibitor
Name:
BDBM9229
Synonyms:
(2R,4S)-2-benzyl-5-[(3S)-3,5-dibenzyl-1,1-dioxo-1,2,5-thiadiazolidin-2-yl]-4-hydroxy-N-[(1S,2R)-2-hydroxy-2,3-dihydro-1H-inden-1-yl]pentanamide | 1,2,5-thiadiazolidine 1,1-dioxide analog
Type:
Small organic molecule
Emp. Form.:
C37H41N3O5S
Mol. Mass.:
639.804
SMILES:
O[C@@H](C[C@@H](Cc1ccccc1)C(=O)N[C@@H]1[C@H](O)Cc2ccccc12)CN1[C@@H](Cc2ccccc2)CN(Cc2ccccc2)S1(=O)=O
:
Substrate
Name:
HIV Protease substrate
Synonyms:
Fluorogenic Peptide Substrate
Type:
Peptide
Mol. Mass.:
3467.28
Organism:
Description:
Residue:
30