Target
Bromodomain-containing protein 2 [91-163]
Ligand
BDBM179493
Substrate
Meas. Tech.
FP Competitive Binding Assay (No.350)
Temperature
298.15±n/a K
Ki
5.70±n/a nM
Comments
extracted
Citation
 Wang, SRan, XZhao, YYang, CLiu, LBai, LMcEachern, DStuckey, JMeagher, JLSun, DLi, XZhou, BKaratas, HLuo, RChinnaiyan, AAsangani, IA BET bromodomain inhibitors and therapeutic methods using the same US Patent  US9675697 Publication Date 6/13/2017 
Target
Name:
Bromodomain-containing protein 2 [91-163]
Synonyms:
BRD2 Bromodomain-containing protein 2 (BRD2)(BD1) KIAA9001 | RING3
Type:
Mol. Mass.:
8836.08
Organism:
Homo sapiens (Human)
Description:
BD1 (91-163 aa) of P25440
Residue:
73
  
Inhibitor
Name:
BDBM179493
Synonyms:
US9675697, Cpd. No. 211
Type:
Small organic molecule
Emp. Form.:
C31H37N7O3
Mol. Mass.:
555.6706
SMILES:
COc1cc2c(cc1-c1c(C)noc1C)[nH]c1nc(C)nc(-c3cc([nH]c3C(C)C)C(=O)NC3CCN(C)CC3)c21
: