Target
Tyrosine-protein kinase JAK2
Ligand
BDBM232618
Substrate
Meas. Tech.
JAK Enzyme Assay
Ki
0.060±n/a nM
Citation
 Zak, MERay, NCGoodacre, SCMendonca, RKellar, TCheng, YLi, WYuen, P 5-chloro-2-difluoromethoxyphenyl pyrazolopyrimidine compounds, compositions and methods of use thereof US Patent  US9604984 Publication Date 3/28/2017 
Target
Name:
Tyrosine-protein kinase JAK2
Synonyms:
JAK-2 JAK2_HUMAN Janus kinase 2 (JAK2) | Janus kinase 2 (a protein tyrosine kinase)
Type:
Protein
Mol. Mass.:
130684.68
Organism:
Homo sapiens (Human)
Description:
O60674
Residue:
1132
  
Inhibitor
Name:
BDBM232618
Synonyms:
US9346815, 164 | US9604984, Example 164
Type:
Small organic molecule
Emp. Form.:
C29H33ClF2N10O3
Mol. Mass.:
643.087
SMILES:
CN1CCN(CCCN2CCC(CC2)n2cc(NC(=O)c3c(N)nn4cccnc34)c(n2)-c2cc(Cl)ccc2OC(F)F)C1=O
: