Target
Tyrosine-protein kinase JAK2
Ligand
BDBM232736
Substrate
Meas. Tech.
JAK Enzyme Assay
Ki
0.120±n/a nM
Citation
 Zak, MERay, NCGoodacre, SCMendonca, RKellar, TCheng, YLi, WYuen, P 5-chloro-2-difluoromethoxyphenyl pyrazolopyrimidine compounds, compositions and methods of use thereof US Patent  US9604984 Publication Date 3/28/2017 
Target
Name:
Tyrosine-protein kinase JAK2
Synonyms:
JAK-2 JAK2_HUMAN Janus kinase 2 (JAK2) | Janus kinase 2 (a protein tyrosine kinase)
Type:
Protein
Mol. Mass.:
130684.68
Organism:
Homo sapiens (Human)
Description:
O60674
Residue:
1132
  
Inhibitor
Name:
BDBM232736
Synonyms:
US9346815, 282 | US9604984, Example 282
Type:
Small organic molecule
Emp. Form.:
C23H19ClF4N8O3
Mol. Mass.:
566.895
SMILES:
Nc1nn2cccnc2c1C(=O)Nc1cn(CC(=O)N2CCC(F)(F)C2)nc1-c1cc(Cl)ccc1OC(F)F
: