Target
Inhibitor of nuclear factor kappa-B kinase subunit beta
Ligand
BDBM312765
Substrate
Meas. Tech.
NIK Enzyme Inhibition Assay
Ki
0.080±n/a nM
Citation
 Blaquiere, NCastanedo, GFeng, JAHu, BStaben, SYuen, PWu, GBurch, J Alkynyl alcohols and methods of use US Patent  US9605005 Publication Date 3/28/2017 
Target
Name:
Inhibitor of nuclear factor kappa-B kinase subunit beta
Synonyms:
I-kappa-B Kinase 2 (IKK-beta) I-kappa-B-kinase beta IKBKB IKK-beta IKK2/IKK1 IKKB_HUMAN Inhibitor of nuclear factor kappa B kinase beta subunit Nuclear factor NF-kappa-B inhibitor kinase beta
Type:
Serine/threonine-protein kinase
Mol. Mass.:
86554.39
Organism:
Homo sapiens (Human)
Description:
GST-tagged IKK-2 was expressed in High Five cells and purified.
Residue:
756
  
Inhibitor
Name:
BDBM312765
Synonyms:
5-fluoro-1-[4-[2-[(3R)-3-hy- droxy-1-methyl-2-oxo-pyrroli- din-3-yl]ethynyl]-2-pyri- diyl]indazole-3-carboxamide | US9605005, Example 54
Type:
Small organic molecule
Emp. Form.:
C20H16FN5O3
Mol. Mass.:
393.3711
SMILES:
CN1CC[C@@](O)(C#Cc2ccnc(c2)-n2nc(C(N)=O)c3cc(F)ccc23)C1=O
: