Target
Caspase-3
Ligand
BDBM10259
Substrate
Caspase-3 Substrate
Meas. Tech.
Caspase Inhibition Assay
pH
7.5±n/a
Temperature
308.15±n/a K
IC50
193±12 nM
Citation
 Chen, YHZhang, YHZhang, HJLiu, DZGu, MLi, JYWu, FZhu, XZLi, JNan, FJ Design, synthesis, and biological evaluation of isoquinoline-1,3,4-trione derivatives as potent caspase-3 inhibitors. J Med Chem 49:1613-23 (2006)  
Target
Name:
Caspase-3
Synonyms:
Apopain CASP3 CPP-32 Caspase 3 Caspase-3 subunit p17 SCA-1 Yama protein | caspase-3 preproprotein
Type:
Hydrolase; heterotetramer of two heterodimers
Mol. Mass.:
31607.55
Organism:
Homo sapiens (Human)
Description:
Residue:
277
  
Inhibitor
Name:
BDBM10259
Synonyms:
Isoquinoline-1,3,4-trione 6f N-(1,3,4-trioxo-1,2,3,4-tetrahydroisoquinolin-5-yl)cyclopropanecarboxamide
Type:
Small organic molecule
Emp. Form.:
C13H10N2O4
Mol. Mass.:
258.2295
SMILES:
O=C(Nc1cccc2C(=O)NC(=O)C(=O)c12)C1CC1
:
Substrate
Name:
Caspase-3 Substrate
Synonyms:
Caspase-3 Substrate (Chromogenic)
Type:
Mol. Mass.:
1438.65
Organism:
Description:
pNA=p-Nitroaniline
Residue:
16
ACASPGLVALASPPNA