Target
Caspase-6
Ligand
BDBM10295
Substrate
Caspase Substrate
Meas. Tech.
Caspase Inhibition Assay
IC50
2850±n/a nM
Citation
 Chen, YHZhang, YHZhang, HJLiu, DZGu, MLi, JYWu, FZhu, XZLi, JNan, FJ Design, synthesis, and biological evaluation of isoquinoline-1,3,4-trione derivatives as potent caspase-3 inhibitors. J Med Chem 49:1613-23 (2006)  
Target
Name:
Caspase-6
Synonyms:
Apoptotic protease Mch-2 CASP6 Caspase | MCH2
Type:
Enzyme
Mol. Mass.:
33312.62
Organism:
Homo sapiens (Human)
Description:
P55212
Residue:
293
  
Inhibitor
Name:
BDBM10295
Synonyms:
4-nitro-N-(1,3,4-trioxo-1,2,3,4-tetrahydroisoquinolin-7-yl)benzamide N-(1,2,3,4-Tetrahydro-1,3,4-trioxoisoquinolin-7-yl)-4-nitrobenzamide
Type:
Small organic molecule
Emp. Form.:
C16H9N3O6
Mol. Mass.:
339.2592
SMILES:
O=C(Nc1ccc2C(=O)C(=O)NC(=O)c2c1)c1ccc(cc1)N(=O)=O
:
Substrate
Name:
Caspase Substrate
Synonyms:
Type:
Mol. Mass.:
358.43
Organism:
Description:
Residue:
3
NA