Target
Serine/threonine-protein kinase B-raf [416-766,V600E]
Ligand
BDBM313482
Substrate
Meas. Tech.
In Vitro Raf Activity Determination
IC50
6391±n/a nM
Citation
 Aversa, RJBurger, MTDillon, MPDineen, Jr., TALou, YNishiguchi, GARamurthy, SRico, ACRauniyar, VSendzik, MSubramanian, SSetti, LQTaft, BRTanner, HRWan, L Compounds and compositions as RAF kinase inhibitors US Patent  US10167279 Publication Date 1/1/2019 
Target
Name:
Serine/threonine-protein kinase B-raf [416-766,V600E]
Synonyms:
B-Raf (V600E) BRAF1 RAFB1
Type:
Mol. Mass.:
39690.71
Organism:
Homo sapiens (Human)
Description:
PV3849, from Invitrogen
Residue:
351
  
Inhibitor
Name:
BDBM313482
Synonyms:
3-(2-aminopropan-2-yl)- N-(3-(5-(3- hydroxyoxetan-3-yl)-6- methoxypyridin-3-yl)-4- methylphenyl)-5- (trifluoromethyl)benzamide | US10167279, Example 101
Type:
Small organic molecule
Emp. Form.:
C27H28F3N3O4
Mol. Mass.:
515.5241
SMILES:
COc1ncc(cc1C1(O)COC1)-c1cc(NC(=O)c2cc(cc(c2)C(F)(F)F)C(C)(C)N)ccc1C
: