Target
Acetylcholinesterase
Ligand
BDBM10410
Substrate
BDBM8959
Meas. Tech.
Enzyme Inhibition Assay
pH
8±n/a
Temperature
295.15±n/a K
IC50
990±200 nM
Citation
 Mary, ARenko, DZGuillou, CThal, C Potent acetylcholinesterase inhibitors: design, synthesis, and structure-activity relationships of bis-interacting ligands in the galanthamine series. Bioorg Med Chem 6:1835-50 (1998)  
Target
Name:
Acetylcholinesterase
Synonyms:
3.1.1.7 Acetylcholinesterase (AChE) ache
Type:
Mol. Mass.:
65900.74
Organism:
Tetronarce californica (Pacific electric ray) (Torpedo californica)
Description:
P04058
Residue:
586
  
Inhibitor
Name:
BDBM10410
Synonyms:
10-N-Demethyl-10-N-(6-phthalimidohexyl)-galanthamine galanthamine deriv. 3c
Type:
Small organic molecule
Emp. Form.:
C30H34N2O5
Mol. Mass.:
502.6014
SMILES:
COc1ccc2CN(CCCCCCN3C(=O)c4ccccc4C3=O)CC[C@@]34C=C[C@H](O)C[C@@H]3Oc1c24
:
Substrate
Name:
BDBM8959
Synonyms:
(2-Mercaptoethyl)trimethylammonium iodide acetate Acetylthiocholine acetylthiocholine chloride | acetylthiocholine iodide
Type:
Small organic molecule
Emp. Form.:
C7H16NOS
Mol. Mass.:
162.272
SMILES:
CC(=O)SCC[N+](C)(C)C
: