Target
Acetylcholinesterase
Ligand
BDBM10421
Substrate
BDBM8959
Meas. Tech.
Enzyme Inhibition Assay
pH
8±n/a
Temperature
295.15±n/a K
IC50
310±20 nM
Citation
 Mary, ARenko, DZGuillou, CThal, C Potent acetylcholinesterase inhibitors: design, synthesis, and structure-activity relationships of bis-interacting ligands in the galanthamine series. Bioorg Med Chem 6:1835-50 (1998)  
Target
Name:
Acetylcholinesterase
Synonyms:
3.1.1.7 Acetylcholinesterase (AChE) ache
Type:
Mol. Mass.:
65900.74
Organism:
Tetronarce californica (Pacific electric ray) (Torpedo californica)
Description:
P04058
Residue:
586
  
Inhibitor
Name:
BDBM10421
Synonyms:
10-N-Demethyl-10-N-(8-trimethylammoniumoctyl) galanthamine bromide {8-[(1S,12S,14R)-14-hydroxy-9-methoxy-11-oxa-4-azatetracyclo[8.6.1.0^{1,12}.0^{6,17}]heptadeca-6(17),7,9,15-tetraen-4-yl]octyl}trimethylazanium bromide
Type:
Small organic molecule
Emp. Form.:
C27H43N2O3
Mol. Mass.:
443.6414
SMILES:
COc1ccc2CN(CCCCCCCC[N+](C)(C)C)CC[C@@]34C=C[C@H](O)C[C@@H]3Oc1c24
:
Substrate
Name:
BDBM8959
Synonyms:
(2-Mercaptoethyl)trimethylammonium iodide acetate Acetylthiocholine acetylthiocholine chloride | acetylthiocholine iodide
Type:
Small organic molecule
Emp. Form.:
C7H16NOS
Mol. Mass.:
162.272
SMILES:
CC(=O)SCC[N+](C)(C)C
: