Target
Acetylcholinesterase
Ligand
BDBM10487
Substrate
BDBM8959
Meas. Tech.
Enzyme Inhibition Assay
pH
7.8±n/a
Temperature
295.15±n/a K
IC50
2.4±n/a nM
Citation
 Doucet-Personeni, CBentley, PDFletcher, RJKinkaid, AKryger, GPirard, BTaylor, ATaylor, RTaylor, JViner, RSilman, ISussman, JLGreenblatt, HMLewis, T A structure-based design approach to the development of novel, reversible AChE inhibitors. J Med Chem 44:3203-15 (2001)  
Target
Name:
Acetylcholinesterase
Synonyms:
3.1.1.7 Acetylcholinesterase (AChE) ache
Type:
Mol. Mass.:
65900.74
Organism:
Tetronarce californica (Pacific electric ray) (Torpedo californica)
Description:
P04058
Residue:
586
  
Inhibitor
Name:
BDBM10487
Synonyms:
1-chloro-6H,7H,8H,9H,10H-cyclohepta[b]quinolin-11-amine Tacrine (THA) analogue 2
Type:
Small organic molecule
Emp. Form.:
C14H15ClN2
Mol. Mass.:
246.735
SMILES:
Nc1c2CCCCCc2nc2cccc(Cl)c12
:
Substrate
Name:
BDBM8959
Synonyms:
(2-Mercaptoethyl)trimethylammonium iodide acetate Acetylthiocholine acetylthiocholine chloride | acetylthiocholine iodide
Type:
Small organic molecule
Emp. Form.:
C7H16NOS
Mol. Mass.:
162.272
SMILES:
CC(=O)SCC[N+](C)(C)C
: