Target
MAP kinase-interacting serine/threonine-protein kinase 2
Ligand
BDBM168223
Substrate
Meas. Tech.
Mnk Biochemical Enzymatic Assay
Temperature
298.15±n/a K
IC50
<10.00±n/a nM
Comments
extracted
Citation
 Reich, SHSprengeler, PAWebber, SEXiang, AXErnst, JT MNK inhibitors and methods related thereto US Patent  US9669031 Publication Date 6/6/2017 
Target
Name:
MAP kinase-interacting serine/threonine-protein kinase 2
Synonyms:
GPRK7 MAP kinase-interacting serine/threonine-protein kinase 2 (MKNK2) MAP-kinase interacting kinase 2 (MNK2) MKNK2_HUMAN | MNK2
Type:
Protein
Mol. Mass.:
51870.79
Organism:
Homo sapiens (Human)
Description:
Q9HBH9
Residue:
465
  
Inhibitor
Name:
BDBM168223
Synonyms:
US9669031, 52 N-[6-[[8-chloro-3-(3-fluorophenyl)-3-methyl-1,5-dioxo-2H-imidazo[1,5-a]pyridin-6-yl]amino]pyrimidin-4-yl]cyclopropanecarboxamide (Cpd. No. 52) | US9669031, 87 6-[(6-aminopyrimidin-4-yl)amino]-8-chloro-3-(3-fluorophenyl)-3-methyl-2H-imidazo[1,5-a]pyridine-1,5-dione (Cpd. No. 87)
Type:
Small organic molecule
Emp. Form.:
C22H18ClFN6O3
Mol. Mass.:
468.868
SMILES:
CC1(NC(=O)c2c(Cl)cc(Nc3cc(NC(=O)C4CC4)ncn3)c(=O)n12)c1cccc(F)c1
: