Target
Lysine-specific histone demethylase 1A
Ligand
BDBM254553
Substrate
Meas. Tech.
LSD1 Assays
pH
7.4±n/a
Temperature
298.15±n/a K
Ki
50±n/a nM
Comments
extracted
Citation
 Ortega Muñoz, AFyfe, MCMartinell Pedemonte, MEstiarte Martinez, MValls Vidal, NKurz, GCastro Palomino Laria, JC (Hetero)aryl cyclopropylamine compounds as LSD1 inhibitors US Patent  US9670136 Publication Date 6/6/2017 
Target
Name:
Lysine-specific histone demethylase 1A
Synonyms:
AOF2 Flavin-containing amine oxidase domain-containing protein 2 KDM1A KIAA0601 Lysine-specific demethylase 1 (LSD1) Lysine-specific histone demethylase 1 (LSD1)
Type:
Enzyme
Mol. Mass.:
92901.01
Organism:
Homo sapiens (Human)
Description:
O60341
Residue:
852
  
Inhibitor
Name:
BDBM254553
Synonyms:
US9469597, 12 | US9670136, 12 4-(((trans)-2-(6-(3-(trifluoromethyl)phenyl)pyridin-3-yl)cyclopropyl)amino)cyclohexanecarboxamide
Type:
Small organic molecule
Emp. Form.:
C22H24F3N3O
Mol. Mass.:
403.4407
SMILES:
NC(=O)C1CCC(CC1)N[C@H]1C[C@@H]1c1ccc(nc1)-c1cccc(c1)C(F)(F)F
: