Target
Lysine-specific histone demethylase 1A
Ligand
BDBM254596
Substrate
Meas. Tech.
LSD1 Assays
pH
7.4±n/a
Temperature
298.15±n/a K
IC50
33±n/a nM
Comments
extracted
Citation
 Ortega Muñoz, AFyfe, MCMartinell Pedemonte, MEstiarte Martinez, MValls Vidal, NKurz, GCastro Palomino Laria, JC (Hetero)aryl cyclopropylamine compounds as LSD1 inhibitors US Patent  US9670136 Publication Date 6/6/2017 
Target
Name:
Lysine-specific histone demethylase 1A
Synonyms:
AOF2 Flavin-containing amine oxidase domain-containing protein 2 KDM1A KIAA0601 Lysine-specific demethylase 1 (LSD1) Lysine-specific histone demethylase 1 (LSD1)
Type:
Enzyme
Mol. Mass.:
92901.01
Organism:
Homo sapiens (Human)
Description:
O60341
Residue:
852
  
Inhibitor
Name:
BDBM254596
Synonyms:
US10214477, Example 55 US9670136, 55 N1-((trans)-2-(4-((3-(piperazin-1-yl)benzyl)oxy)phenyl)cyclopropyl) cyclohexane-1,4-diamine
Type:
Small organic molecule
Emp. Form.:
C26H36N4O
Mol. Mass.:
420.5902
SMILES:
NC1CCC(CC1)N[C@H]1C[C@@H]1c1ccc(OCc2cccc(c2)N2CCNCC2)cc1
: