Target
Poly [ADP-ribose] polymerase 2
Ligand
BDBM207575
Substrate
Meas. Tech.
Enzymatic Assay
IC50
500±n/a nM
Citation
 Zhou, CRen, BWang, H Fused tetra or penta-cyclic dihydrodiazepinocarbazolones as PARP inhibitors US Patent  US9617273 Publication Date 4/11/2017 
Target
Name:
Poly [ADP-ribose] polymerase 2
Synonyms:
(ARTD2 or PARP2) ADPRTL2 PARP2_HUMAN Poly [ADP-ribose] polymerase 2 (PARP2)
Type:
Enzyme
Mol. Mass.:
66225.70
Organism:
Homo sapiens (Human)
Description:
Q9UGN5
Residue:
583
  
Inhibitor
Name:
BDBM207575
Synonyms:
US10501467, Example 20 US9617273, Example 20
Type:
Small organic molecule
Emp. Form.:
C20H16N4O3
Mol. Mass.:
360.366
SMILES:
O=C(OCc1ccccc1)N1Cc2[nH]c3cccc4c3c2c(C1)n[nH]c4=O
: