Target
Serine/threonine-protein kinase B-raf [V600E]
Ligand
BDBM207588
Substrate
Meas. Tech.
Enzymatic Assay
IC50
11000000±n/a nM
Citation
 Zhou, CRen, BWang, H Fused tetra or penta-cyclic dihydrodiazepinocarbazolones as PARP inhibitors US Patent  US9617273 Publication Date 4/11/2017 
Target
Name:
Serine/threonine-protein kinase B-raf [V600E]
Synonyms:
B-RAF V600E B-Raf Protein Kinase Mutant (V600E) BRAF BRAF mutant V600E BRAF_HUMAN Protein mono-ADP-ribosyltransferase (PARP3) RAFB1 Serine/threonine-protein kinase B-raf (V600E) V-RAF murine sarcoma viral oncogene homologue B1 mutant (BRAF V600E)
Type:
Mol. Mass.:
84474.98
Organism:
Homo sapiens (Human)
Description:
P15056 V600E
Residue:
766
  
Inhibitor
Name:
BDBM207588
Synonyms:
US10501467, Example 33 US9617273, Example 33
Type:
Small organic molecule
Emp. Form.:
C21H28N4O
Mol. Mass.:
352.4732
SMILES:
CCN(CC)CCn1c2CC(C)(C)Cc3n[nH]c(=O)c4cccc1c4c23
: