Target
Poly [ADP-ribose] polymerase tankyrase-2
Ligand
BDBM207588
Substrate
Meas. Tech.
Enzymatic Assay
IC50
2400000±n/a nM
Citation
 Zhou, CRen, BWang, H Fused tetra or penta-cyclic dihydrodiazepinocarbazolones as PARP inhibitors US Patent  US9617273 Publication Date 4/11/2017 
Target
Name:
Poly [ADP-ribose] polymerase tankyrase-2
Synonyms:
(ARTD6 or PARP5b) Poly [ADP-ribose] polymerase tankyrase-2 TNKL TNKS2_HUMAN Tankyrase 2 Tankyrase-2 Tankyrase-2 (TNKS2)
Type:
Enzyme
Mol. Mass.:
126937.16
Organism:
Homo sapiens (Human)
Description:
Q9H2K2
Residue:
1166
  
Inhibitor
Name:
BDBM207588
Synonyms:
US10501467, Example 33 US9617273, Example 33
Type:
Small organic molecule
Emp. Form.:
C21H28N4O
Mol. Mass.:
352.4732
SMILES:
CCN(CC)CCn1c2CC(C)(C)Cc3n[nH]c(=O)c4cccc1c4c23
: