Target
Poly [ADP-ribose] polymerase tankyrase-2
Ligand
BDBM207617
Substrate
Meas. Tech.
Enzymatic Assay
IC50
3800000±n/a nM
Citation
 Zhou, CRen, BWang, H Fused tetra or penta-cyclic dihydrodiazepinocarbazolones as PARP inhibitors US Patent  US9617273 Publication Date 4/11/2017 
Target
Name:
Poly [ADP-ribose] polymerase tankyrase-2
Synonyms:
(ARTD6 or PARP5b) Poly [ADP-ribose] polymerase tankyrase-2 TNKL TNKS2_HUMAN Tankyrase 2 Tankyrase-2 Tankyrase-2 (TNKS2)
Type:
Enzyme
Mol. Mass.:
126937.16
Organism:
Homo sapiens (Human)
Description:
Q9H2K2
Residue:
1166
  
Inhibitor
Name:
BDBM207617
Synonyms:
US9260440, 62 | US9617273, Example 62
Type:
Small organic molecule
Emp. Form.:
C16H17N5O2
Mol. Mass.:
311.3385
SMILES:
CC(C)(N)C(=O)N1Cc2[nH]c3cccc4c3c2c(C1)n[nH]c4=O
: