Target
Proto-oncogene tyrosine-protein kinase receptor Ret
Ligand
BDBM284566
Substrate
Meas. Tech.
RET Enzyme Assay
IC50
13.6±n/a nM
Citation
 Andrews, SWBlake, JFChicarelli, MJGolos, AHaas, JJiang, YKolakowski, GR Substituted pyrazolo[1,5-a]pyridine compounds as RET kinase inhibitors US Patent  US10174027 Publication Date 1/8/2019 
Target
Name:
Proto-oncogene tyrosine-protein kinase receptor Ret
Synonyms:
CDHF12 Cadherin family member 12 Proto-oncogene c-Ret RET51 Tyrosine-protein kinase Ret (RET)
Type:
Protein
Mol. Mass.:
124318.29
Organism:
Homo sapiens (Human)
Description:
P07949
Residue:
1114
  
Inhibitor
Name:
BDBM284566
Synonyms:
US10023570, Example 585 | US10174027, Example 585
Type:
Small organic molecule
Emp. Form.:
C26H28F2N8O
Mol. Mass.:
506.5503
SMILES:
CC(C)OCCN1CCN(CC1)c1ccc(cn1)-c1cc(cn2ncc(C#N)c12)-c1cnn(c1)C(F)F
: