Target
Proto-oncogene tyrosine-protein kinase receptor Ret [V804M]
Ligand
BDBM284648
Substrate
Meas. Tech.
RET Enzyme Assay
IC50
148±n/a nM
Citation
 Andrews, SWBlake, JFChicarelli, MJGolos, AHaas, JJiang, YKolakowski, GR Substituted pyrazolo[1,5-A]pyridine compounds as RET kinase inhibitors US Patent  US10174028 Publication Date 1/8/2019 
Target
Name:
Proto-oncogene tyrosine-protein kinase receptor Ret [V804M]
Synonyms:
CDHF12 PTC RET RET51 ret enzyme (v804m)
Type:
Enzyme Catalytic Domain
Mol. Mass.:
124350.36
Organism:
Homo sapiens (Human)
Description:
P07949[V804M]
Residue:
1114
  
Inhibitor
Name:
BDBM284648
Synonyms:
US10023570, Example 683 | US10174027, Example 683
Type:
Small organic molecule
Emp. Form.:
C28H27N9O
Mol. Mass.:
505.5737
SMILES:
Cn1cc(cn1)-c1cc(-c2ccc(nc2)N2CCN(Cc3ccn(C)c(=O)c3)CC2)c2c(cnn2c1)C#N
: