Target
Proto-oncogene tyrosine-protein kinase receptor Ret
Ligand
BDBM284689
Substrate
Meas. Tech.
RET Enzyme Assay
IC50
11.8±n/a nM
Citation
 Andrews, SWBlake, JFChicarelli, MJGolos, AHaas, JJiang, YKolakowski, GR Substituted pyrazolo[1,5-A]pyridine compounds as RET kinase inhibitors US Patent  US10174028 Publication Date 1/8/2019 
Target
Name:
Proto-oncogene tyrosine-protein kinase receptor Ret
Synonyms:
CDHF12 Cadherin family member 12 Proto-oncogene c-Ret RET51 Tyrosine-protein kinase Ret (RET)
Type:
Protein
Mol. Mass.:
124318.29
Organism:
Homo sapiens (Human)
Description:
P07949
Residue:
1114
  
Inhibitor
Name:
BDBM284689
Synonyms:
US10023570, Example 724 | US10174027, Example 724
Type:
Small organic molecule
Emp. Form.:
C28H26N8OS
Mol. Mass.:
522.624
SMILES:
COc1ccc(CN2CCN(CC2)c2ccc(cn2)-c2cc(cn3ncc(C#N)c23)-c2cnc(C)s2)cn1
: