Target
Replicase polyprotein 1ab
Ligand
BDBM11231
Substrate
Substrate Peptide
Meas. Tech.
3CL Protease Enzyme Assays
pH
7.5±n/a
Temperature
298.15±n/a K
Ki
660±n/a nM
Citation
 Yang, SChen, SJHsu, MFWu, JDTseng, CTLiu, YFChen, HCKuo, CWWu, CSChang, LWChen, WCLiao, SYChang, TYHung, HHShr, HLLiu, CYHuang, YAChang, LYHsu, JCPeters, CJWang, AHHsu, MC Synthesis, crystal structure, structure-activity relationships, and antiviral activity of a potent SARS coronavirus 3CL protease inhibitor. J Med Chem 49:4971-80 (2006)  
Target
Name:
Replicase polyprotein 1ab
Synonyms:
3C-like proteinase 3C-like proteinase (SARS-CoV 3Cpro) 3CLp GFL Guanine-N7 methyltransferase Helicase Leader protein Non-structural protein 10 Non-structural protein 3 Non-structural protein 6 Non-structural protein 8 ORF1ab polyprotein PL2-PRO Pol R1AB_SARS RdRp SARS coronavirus main proteinase nsp1 nsp12 nsp14 nsp16 nsp3 nsp5 nsp7 nsp9 pp1ab | rep
Type:
Protein
Mol. Mass.:
790250.81
Organism:
Human SARS coronavirus (SARS-CoV) (Severe acute respiratory syndrome coronavirus)
Description:
P0C6X7
Residue:
7073
  
Inhibitor
Name:
BDBM11231
Synonyms:
N-[(benzyloxy)carbonyl]-L-valyl-N1-((1S,2E)-4-ethoxy-4-oxo-1-{[(3S)-2-oxopyrrolidin-3-yl]methyl}but-2-enyl)-L-leucinamide cmdc.202100576, 5c peptidomimetic coronavirus 3CLpro inhibitors 3
Type:
Small organic molecule
Emp. Form.:
C30H44N4O7
Mol. Mass.:
572.693
SMILES:
CCOC(=O)\C=C\[C@H](C[C@@H]1CCNC1=O)NC(=O)[C@H](CC(C)C)NC(=O)[C@@H](NC(=O)OCc1ccccc1)C(C)C
:
Substrate
Name:
Substrate Peptide
Synonyms:
Type:
Peptide
Mol. Mass.:
1597.88
Organism:
Description:
Residue:
15
SITSAVLQSGFRKMA