Target
Carbonic anhydrase 2
Ligand
BDBM11409
Substrate
BDBM11402
Meas. Tech.
In vitro binding of inhibitor to hCA-II
Ki
0.33±n/a nM
Citation
 Chen, HHGross, SLiao, JMcLaughlin, MDean, TSly, WSMay, JA 2H-Thieno[3,2-e]- and [2,3-e]-1,2-thiazine-6-sulfonamide 1,1-dioxides as ocular hypotensive agents: synthesis, carbonic anhydrase inhibition and evaluation in the rabbit. Bioorg Med Chem 8:957-75 (2000)  
Target
Name:
Carbonic anhydrase 2
Synonyms:
CA-II CAC Carbonate dehydratase II Carbonic anhydrase 2 (CA-II) Carbonic anhydrase C Carbonic anhydrase II (CA-II) Carbonic anhydrase II (hCA II) | Carbonic anhydrase isoenzyme II (hCA II)
Type:
Enzyme
Mol. Mass.:
29250.71
Organism:
Homo sapiens (Human)
Description:
P00918
Residue:
260
  
Inhibitor
Name:
BDBM11409
Synonyms:
2-(1-Methylethyl)-3-[(4-morpholinyl)methyl]-2H-thieno-[3,2-e]-1,2-thiazine-6-sulfonamide 1,1-dioxide 3-(morpholin-4-ylmethyl)-1,1-dioxo-2-(propan-2-yl)-2H-1,7,2-thieno[3,2-e][1,2]thiazine-6-sulfonamide | Compound 17d1
Type:
Small organic molecule
Emp. Form.:
C14H21N3O5S3
Mol. Mass.:
407.529
SMILES:
CC(C)N1C(CN2CCOCC2)=Cc2cc(sc2S1(=O)=O)S(N)(=O)=O
:
Substrate
Name:
BDBM11402
Synonyms:
5-(dimethylamino)naphthalene-1-sulfonamide | dansylamide
Type:
Small organic molecule
Emp. Form.:
C12H14N2O2S
Mol. Mass.:
250.317
SMILES:
CN(C)c1cccc2c(cccc12)S(N)(=O)=O
: