Target
Tyrosine-protein kinase JAK2
Ligand
BDBM292118
Substrate
Ki
<0.1±n/a nM
Citation
 Benjamin, NDabros, MThalladi, VR JAK kinase inhibitor compounds for treatment of respiratory disease US Patent  US10183942 Publication Date 1/22/2019 
Target
Name:
Tyrosine-protein kinase JAK2
Synonyms:
JAK-2 JAK2_HUMAN Janus kinase 2 (JAK2) | Janus kinase 2 (a protein tyrosine kinase)
Type:
Protein
Mol. Mass.:
130684.68
Organism:
Homo sapiens (Human)
Description:
O60674
Residue:
1132
  
Inhibitor
Name:
BDBM292118
Synonyms:
US10100049, Example 15 US10526330, Example 15 US11299492, Example 15 | US11718616, Example 15
Type:
Small organic molecule
Emp. Form.:
C28H33FN6O
Mol. Mass.:
488.5996
SMILES:
CCc1cc(O)c(F)cc1-c1ccc2c(n[nH]c2c1)-c1nc2CN(CCN3CCC[C@@H]3C)CCc2[nH]1
: