Target
Carbonic anhydrase 2
Ligand
BDBM11618
Substrate
BDBM10856
Meas. Tech.
CA Inhibition Assay
Ki
1.5±n/a nM
Citation
 Ilies, MAVullo, DPastorek, JScozzafava, AIlies, MCaproiu, MTPastorekova, SSupuran, CT Carbonic anhydrase inhibitors. Inhibition of tumor-associated isozyme IX by halogenosulfanilamide and halogenophenylaminobenzolamide derivatives. J Med Chem 46:2187-96 (2003)  
Target
Name:
Carbonic anhydrase 2
Synonyms:
CA-II CAC Carbonate dehydratase II Carbonic anhydrase 2 (CA-II) Carbonic anhydrase C Carbonic anhydrase II (CA-II) Carbonic anhydrase II (hCA II) | Carbonic anhydrase isoenzyme II (hCA II)
Type:
Enzyme
Mol. Mass.:
29250.71
Organism:
Homo sapiens (Human)
Description:
P00918
Residue:
260
  
Inhibitor
Name:
BDBM11618
Synonyms:
5-(4-Acetamido-3-bromobenzenesulfonamido)-1,3,4-thiadiazole-2-sulfonamide aminobenzolamide 16d | aminobenzolamide deriv. 42
Type:
Small organic molecule
Emp. Form.:
C10H10BrN5O5S3
Mol. Mass.:
456.316
SMILES:
CC(=O)Nc1ccc(cc1Br)S(=O)(=O)Nc1nnc(s1)S(N)(=O)=O
:
Substrate
Name:
BDBM10856
Synonyms:
Carbon Dioxide | methanedione
Type:
Small organic molecule
Emp. Form.:
CO2
Mol. Mass.:
44.0095
SMILES:
O=C=O
: