Target
Stromelysin-1
Ligand
BDBM11866
Substrate
MMP-3 Fluorogenic Peptide Substrate
Meas. Tech.
Enzyme Inhibition Assay
Ki
18.1±n/a nM
Citation
 Becker, DPVillamil, CIBarta, TEBedell, LJBoehm, TLDecrescenzo, GAFreskos, JNGetman, DPHockerman, SHeintz, RHoward, SCLi, MHMcDonald, JJCarron, CPFunckes-Shippy, CLMehta, PPMunie, GESwearingen, CA Synthesis and structure-activity relationships of beta- and alpha-piperidine sulfone hydroxamic acid matrix metalloproteinase inhibitors with oral antitumor efficacy. J Med Chem 48:6713-30 (2005)  
Target
Name:
Stromelysin-1
Synonyms:
MMP-3 MMP3_HUMAN Matrix metalloproteinase 3 Matrix metalloproteinase-3 (MMP-3) SL-1 Stromelysin 1 | Transin-1
Type:
Enzyme
Mol. Mass.:
53973.13
Organism:
Homo sapiens (Human)
Description:
P08254
Residue:
477
  
Inhibitor
Name:
BDBM11866
Synonyms:
N-Hydroxy-1-(3-methoxybenzyl)-4-{[(4-phenoxyphenyl)-sulfonyl]methyl}piperidine-4-carboxamide Hydrochloride beta-sulfone 7c
Type:
Small organic molecule
Emp. Form.:
C27H30N2O6S
Mol. Mass.:
510.602
SMILES:
COc1cccc(CN2CCC(CS(=O)(=O)c3ccc(Oc4ccccc4)cc3)(CC2)C(=O)NO)c1
:
Substrate
Name:
MMP-3 Fluorogenic Peptide Substrate
Synonyms:
NFF-3
Type:
Peptide
Mol. Mass.:
3799.85
Organism:
Description:
Residue:
35