Target
Stromelysin-1
Ligand
BDBM11887
Substrate
MMP-3 Fluorogenic Peptide Substrate
Meas. Tech.
Enzyme Inhibition Assay
Ki
32±n/a nM
Citation
 Becker, DPVillamil, CIBarta, TEBedell, LJBoehm, TLDecrescenzo, GAFreskos, JNGetman, DPHockerman, SHeintz, RHoward, SCLi, MHMcDonald, JJCarron, CPFunckes-Shippy, CLMehta, PPMunie, GESwearingen, CA Synthesis and structure-activity relationships of beta- and alpha-piperidine sulfone hydroxamic acid matrix metalloproteinase inhibitors with oral antitumor efficacy. J Med Chem 48:6713-30 (2005)  
Target
Name:
Stromelysin-1
Synonyms:
MMP-3 MMP3_HUMAN Matrix metalloproteinase 3 Matrix metalloproteinase-3 (MMP-3) SL-1 Stromelysin 1 | Transin-1
Type:
Enzyme
Mol. Mass.:
53973.13
Organism:
Homo sapiens (Human)
Description:
P08254
Residue:
477
  
Inhibitor
Name:
BDBM11887
Synonyms:
N-Hydroxy-1-(methylsulfonyl)-4-{[4-(phenylthio)phenyl]-sulfonyl}piperidine-4-carboxamide alpha-sulfone 35h
Type:
Small organic molecule
Emp. Form.:
C19H22N2O6S3
Mol. Mass.:
470.583
SMILES:
CS(=O)(=O)N1CCC(CC1)(C(=O)NO)S(=O)(=O)c1ccc(Sc2ccccc2)cc1
:
Substrate
Name:
MMP-3 Fluorogenic Peptide Substrate
Synonyms:
NFF-3
Type:
Peptide
Mol. Mass.:
3799.85
Organism:
Description:
Residue:
35