Target
Matrix metalloproteinase-9
Ligand
BDBM11869
Substrate
MMP Fluorogenic Peptide Substrate
Meas. Tech.
Enzyme Inhibition Assay
Ki
7.0±n/a nM
Citation
 Becker, DPVillamil, CIBarta, TEBedell, LJBoehm, TLDecrescenzo, GAFreskos, JNGetman, DPHockerman, SHeintz, RHoward, SCLi, MHMcDonald, JJCarron, CPFunckes-Shippy, CLMehta, PPMunie, GESwearingen, CA Synthesis and structure-activity relationships of beta- and alpha-piperidine sulfone hydroxamic acid matrix metalloproteinase inhibitors with oral antitumor efficacy. J Med Chem 48:6713-30 (2005)  
Target
Name:
Matrix metalloproteinase-9
Synonyms:
67 kDa matrix metalloproteinase-9 92 kDa gelatinase CLG4B Gelatinase B MMP9 Matrix metalloproteinase 9 (MMP-9) Matrix metalloproteinase-9 (MMP9)
Type:
Enzyme
Mol. Mass.:
78452.28
Organism:
Homo sapiens (Human)
Description:
P14780
Residue:
707
  
Inhibitor
Name:
BDBM11869
Synonyms:
4-({[4-(3,4-Dimethylphenoxy)phenyl]sulfonyl}methyl)-N-hydroxy-1-prop-2-ynylpiperidine-4-carboxamide Hydrochloride beta-sulfone 7f
Type:
Small organic molecule
Emp. Form.:
C24H28N2O5S
Mol. Mass.:
456.555
SMILES:
Cc1ccc(Oc2ccc(cc2)S(=O)(=O)CC2(CCN(CC#C)CC2)C(=O)NO)cc1C
:
Substrate
Name:
MMP Fluorogenic Peptide Substrate
Synonyms:
Type:
Peptide
Mol. Mass.:
2468.31
Organism:
Description:
Residue:
23