Target
Sphingosine 1-phosphate receptor 2
Ligand
BDBM329368
Substrate
Meas. Tech.
In Vitro Binding Assay
IC50
1.20±n/a nM
Citation
 Swenson, RE Sphingosine 1-phosphate receptor antagonists US Patent  US9663511 Publication Date 5/30/2017 
Target
Name:
Sphingosine 1-phosphate receptor 2
Synonyms:
EDG5 S1PR2 Sphingosine 1-phosphate receptor Sphingosine-1-phosphate receptor 2 | ndothelial differentiation G-protein coupled receptor 5
Type:
G Protein-Coupled Receptor (GPCR)
Mol. Mass.:
38883.16
Organism:
Homo sapiens (Human)
Description:
Membranes isolated from S1P2-transfected CHO cells were used in ligand binding assay.
Residue:
353
  
Inhibitor
Name:
BDBM329368
Synonyms:
US9663511, Compound 1. | US9663511, Compound 27.
Type:
Small organic molecule
Emp. Form.:
C19H21Cl2N7O
Mol. Mass.:
434.322
SMILES:
CC(C)c1cc(NNC(=O)Nc2cc(Cl)nc(Cl)c2)nc2n(CC=C)nc(C)c12
: