Target
Sigma intracellular receptor 2
Ligand
BDBM312235
Substrate
Meas. Tech.
Receptor Assay
Ki
0.500±0.30 nM
Citation
 McCurdy, CRMesangeau, CChin, FTJames, MLShen, BGambhir, SBiswal, SBehera, D Highly selective sigma receptor ligands and radioligands as probes in nociceptive processing and the pathphysiological study of memory deficits and cognitive disorders US Patent  US9724435 Publication Date 8/8/2017 
Target
Name:
Sigma intracellular receptor 2
Synonyms:
S2r Sigma intracellular receptor 2 Sigma2 receptor Transmembrane protein 97
Type:
Protein
Mol. Mass.:
20953.88
Organism:
Rattus norvegicus (Rat)
Description:
Q5U3Y7
Residue:
176
  
Inhibitor
Name:
BDBM312235
Synonyms:
US9604926, Compound AZ-78 | US9724435, Compound AZ-78
Type:
Small organic molecule
Emp. Form.:
C21H30FN3S2
Mol. Mass.:
407.611
SMILES:
Fc1ccc2n(CCCCN3CCN(CC3)C3CCCCC3)c(=S)sc2c1
: