Target
Cystathionine gamma-lyase
Ligand
BDBM330300
Substrate
Meas. Tech.
In Vitro Assay
IC50
<10000±n/a nM
Citation
 Durón, SGChapman, JSydserff, SGRao, SGStein, GWade, W Cystathionine-γ-lyase (CSE) inhibitors US Patent  US9725426 Publication Date 8/8/2017 
Target
Name:
Cystathionine gamma-lyase
Synonyms:
CGL_HUMAN Cystathionine gamma-lyase (CSE) Gamma-cystathionase
Type:
Protein
Mol. Mass.:
44509.52
Organism:
Homo sapiens (Human)
Description:
P32929
Residue:
405
  
Inhibitor
Name:
BDBM330300
Synonyms:
US9725426, 4
Type:
Small organic molecule
Emp. Form.:
C3H8N6
Mol. Mass.:
128.1358
SMILES:
CCN(N)c1nnn[nH]1
: