Target
Nuclear receptor ROR-gamma
Ligand
BDBM332453
Substrate
Meas. Tech.
Biological Assays
IC50
491±n/a nM
Citation
 Barr, KJBienstock, CEMaclean, JKZhang, HBeresis, RTZhang, DAnthony, NJLapointe, BTTian, Y 4-heteroaryl substituted benzoic acid compounds as RORgammaT inhibitors and uses thereof US Patent  US10196354 Publication Date 2/5/2019 
Target
Name:
Nuclear receptor ROR-gamma
Synonyms:
NR1F3 Nuclear receptor ROR-gamma (RORC) RAR-related orphan receptor C (RORc) RORG RZRG Retinoid-related orphan receptor-gamma (RORc)
Type:
Enzyme Catalytic Domain
Mol. Mass.:
58218.40
Organism:
Homo sapiens (Human)
Description:
P51449
Residue:
518
  
Inhibitor
Name:
BDBM332453
Synonyms:
4-(1-(2-chloro- 6-(trifluoro- methyl)benzoyl)- 6-(1,3-dimethyl- ureido)-1H- indazol-3-yl)-3-fluorobenzoic US9745265, 5H
Type:
Small organic molecule
Emp. Form.:
C25H17ClF4N4O4
Mol. Mass.:
548.873
SMILES:
CNC(=O)N(C)c1ccc2c(nn(C(=O)c3c(Cl)cccc3C(F)(F)F)c2c1)-c1ccc(cc1F)C(O)=O
: