Target
Nuclear receptor ROR-gamma
Ligand
BDBM332454
Substrate
Meas. Tech.
Biological Assays
IC50
85.0±n/a nM
Citation
 Barr, KJBienstock, CEMaclean, JKZhang, HBeresis, RTZhang, DAnthony, NJLapointe, BTTian, Y 4-heteroaryl substituted benzoic acid compounds as RORgammaT inhibitors and uses thereof US Patent  US10196354 Publication Date 2/5/2019 
Target
Name:
Nuclear receptor ROR-gamma
Synonyms:
NR1F3 Nuclear receptor ROR-gamma (RORC) RAR-related orphan receptor C (RORc) RORG RZRG Retinoid-related orphan receptor-gamma (RORc)
Type:
Enzyme Catalytic Domain
Mol. Mass.:
58218.40
Organism:
Homo sapiens (Human)
Description:
P51449
Residue:
518
  
Inhibitor
Name:
BDBM332454
Synonyms:
4-(1-(2-chloro-6-(trifluoromethyl)benzoyl)-6-(2-oxo-imidazolidin-1-yl)-1H-indazol-3-yl)-3-fluorobenzoic acid (6A) US9745265, 6A
Type:
Small organic molecule
Emp. Form.:
C25H15ClF4N4O4
Mol. Mass.:
546.858
SMILES:
OC(=O)c1ccc(-c2nn(C(=O)c3c(Cl)cccc3C(F)(F)F)c3cc(ccc23)N2CCNC2=O)c(F)c1
: