Target
Cyclin-dependent kinase/G2/mitotic-specific cyclin- 1
Ligand
BDBM12611
Substrate
GST-Rb fusion protein
Meas. Tech.
Homogeneous Time-resolved Fluorescence (HTRF) Assay
Ki
28±n/a nM
Citation
 Chu, XJDePinto, WBartkovitz, DSo, SSVu, BTPackman, KLukacs, CDing, QJiang, NWang, KGoelzer, PYin, XSmith, MAHiggins, BXChen, YXiang, QMoliterni, JKaplan, GGraves, BLovey, AFotouhi, N Discovery of [4-Amino-2-(1-methanesulfonylpiperidin-4-ylamino)pyrimidin-5-yl](2,3-difluoro-6-methoxyphenyl)methanone (R547), a potent and selective cyclin-dependent kinase inhibitor with significant in vivo antitumor activity. J Med Chem 49:6549-60 (2006)  
Target
Name:
Cyclin-dependent kinase/G2/mitotic-specific cyclin- 1
Synonyms:
CDK1/B CDK1/CyclinB Cyclin-Dependent Kinase 1 (CDK1) Cyclin-dependent kinase/G2/mitotic-specific cyclin 1 | cdk1
Type:
Protein Complex
Mol. Mass.:
Description:
CDK1/Cyclin B complexes were purified from insect cells co-infected with baculovirus vectors containing each of the components.
Components:
This complex has 2 components.
Component 1
Name:
Cyclin-dependent kinase 1
Synonyms:
CDC2 CDK1 CDKN1 Cell division protein kinase 1 P34CDC2 | p34 protein kinase
Type:
Enzyme Subunit
Mol. Mass.:
34101.08
Organism:
Homo sapiens (Human)
Description:
P06493
Residue:
297
  
Component 2
Name:
G2/mitotic-specific cyclin-B1
Synonyms:
CCNB CCNB1_HUMAN
Type:
Enzyme Subunit
Mol. Mass.:
48340.95
Organism:
Homo sapiens (Human)
Description:
P14635
Residue:
433
  
Inhibitor
Name:
BDBM12611
Synonyms:
2,4-Diamino-5-ketopyrimidine 29 [4-Amino-2-(1-methanesulfonylpiperidin-4-ylamino)pyrimidin-5-yl](2-methoxyphenyl)methanone
Type:
Small organic molecule
Emp. Form.:
C18H23N5O4S
Mol. Mass.:
405.471
SMILES:
COc1ccccc1C(=O)c1cnc(NC2CCN(CC2)S(C)(=O)=O)nc1N
:
Substrate
Name:
GST-Rb fusion protein
Synonyms:
Glutathione S-transferase (GST)-retinoblastoma (Rb) fusion RB1 Rb | retinoblastoma
Type:
Other Protein Type
Mol. Mass.:
106410.17
Organism:
Homo sapiens (Human)
Description:
GST-60 kDa Rb fusion protein (comprising amino acids 378 to 928 of retinoblastoma)
Residue:
928