Target
Coagulation factor X
Ligand
BDBM12749
Substrate
BDBM12658
Meas. Tech.
Enzyme Assay and Determination of the Inhibition Constants.
pH
7±n/a
Temperature
295.15±n/a K
Ki
0.2±n/a nM
Citation
 Pinto, DJGalemmo, RAQuan, MLOrwat, MJClark, CLi, RWells, BWoerner, FAlexander, RSRossi, KASmallwood, AWong, PCLuettgen, JMRendina, ARKnabb, RMHe, KWexler, RRLam, PY Discovery of potent, efficacious, and orally bioavailable inhibitors of blood coagulation factor Xa with neutral P1 moieties. Bioorg Med Chem Lett 16:5584-9 (2006)  
Target
Name:
Coagulation factor X
Synonyms:
Activated coagulation factor X (FXa) Coagulation factor X precursor F10 Factor X heavy chain Factor Xa Stuart-Prower factor
Type:
Enzyme
Mol. Mass.:
54726.60
Organism:
Homo sapiens (Human)
Description:
Residue:
488
  
Inhibitor
Name:
BDBM12749
Synonyms:
1-(2-amino-4-methoxyphenyl)-6-[4-(2-methanesulfonylphenyl)phenyl]-3-(trifluoromethyl)-1H,4H,5H,6H,7H-pyrazolo[3,4-c]pyridin-7-one | dihydropyrazolopyridinone analogue 8f
Type:
Small organic molecule
Emp. Form.:
C27H23F3N4O4S
Mol. Mass.:
556.556
SMILES:
COc1ccc(c(N)c1)-n1nc(c2CCN(C(=O)c12)c1ccc(cc1)-c1ccccc1S(C)(=O)=O)C(F)(F)F
:
Substrate
Name:
BDBM12658
Synonyms:
4-[({[(1S)-4-carbamimidamido-1-[(4-nitrophenyl)carbamoyl]butyl]carbamoyl}methyl)carbamoyl]-4-[(2S,3S)-3-methyl-2-(phenylformamido)pentanamido]butanoic acid hydrochloride Chromogenic Substrate S-2222 benzoyl-Ile-Glu-Gly-Arg-p-nitroanilide
Type:
Small organic molecule
Emp. Form.:
C32H43N9O9
Mol. Mass.:
697.7387
SMILES:
[#6]-[#6]-[#6@H](-[#6])-[#6@H](-[#7]-[#6](=O)-c1ccccc1)-[#6](=O)-[#7]-[#6@@H](-[#6]-[#6]-[#6](-[#8])=O)-[#6](=O)-[#7]-[#6]-[#6](=O)-[#7]-[#6@@H](-[#6]-[#6]-[#6]\[#7]=[#6](\[#7])-[#7])-[#6](=O)-[#7]-c1ccc(cc1)-[#7+](-[#8-])=O
: