Target
Receptor tyrosine-protein kinase erbB-2
Ligand
BDBM333449
Substrate
IC50
12.0±n/a nM
Citation
 Huang, ZDong, Y Quinazoline derivatives substituted by aniline, preparation method and use thereof US Patent  US9730934 Publication Date 8/15/2017 
Target
Name:
Receptor tyrosine-protein kinase erbB-2
Synonyms:
2.7.10.1 CD_antigen=CD340 ERBB2_HUMAN FASN/HER2 HER2 MLN19 NEU Proto-oncogene Neu Tyrosine kinase-type cell surface receptor HER2 | p185erbB2
Type:
Mol. Mass.:
137894.47
Organism:
Homo sapiens (Human)
Description:
P04626
Residue:
1255
  
Inhibitor
Name:
BDBM333449
Synonyms:
N-[4-(3-chloro-4- fluorophenylamino)-7-(2-(3-methyl- 3-azabicyclo[3.2.1]octan-8- yl)ethoxy)quinazolin-6-yl]- acrylamide US9730934, Compound 11
Type:
Small organic molecule
Emp. Form.:
C27H29ClFN5O2
Mol. Mass.:
510.003
SMILES:
CN1CC2CCC(C1)C2CCOc1cc2ncnc(Nc3ccc(F)c(Cl)c3)c2cc1NC(=O)C=C
: