Target
Tyrosine-protein kinase ABL1 [201-500,T315I]
Ligand
BDBM13534
Substrate
BDBM13531
Meas. Tech.
Kinase Assay and Binding Constant Measurement
Kd
5±n/a nM
Citation
 Carter, TAWodicka, LMShah, NPVelasco, AMFabian, MATreiber, DKMilanov, ZVAtteridge, CEBiggs, WHEdeen, PTFloyd, MFord, JMGrotzfeld, RMHerrgard, SInsko, DEMehta, SAPatel, HKPao, WSawyers, CLVarmus, HZarrinkar, PPLockhart, DJ Inhibition of drug-resistant mutants of ABL, KIT, and EGF receptor kinases. Proc Natl Acad Sci U S A 102:11011-6 (2005)  
Target
Name:
Tyrosine-protein kinase ABL1 [201-500,T315I]
Synonyms:
ABL ABL1 JTK7 c-ABL | p150
Type:
Enzyme
Mol. Mass.:
34607.81
Organism:
Homo sapiens (Human)
Description:
P00519[201-500,T315I]
Residue:
300
  
Inhibitor
Name:
BDBM13534
Synonyms:
CHEMBL572878 N-[4-[[4-(4-methylpiperazino)-6-[(5-methyl-1H-pyrazol-3-yl)amino]pyrimidin-2-yl]thio]phenyl]cyclopropanecarboxamide VX680 | cyclopropane carboxylic acid {4-[4-(4-methyl-piperazin-1-yl)-6-(5-methyl-2H-pyrazol-3-ylamino)-pyrimidin-2ylsulphanyl]-phenyl}-amide
Type:
Small organic molecule
Emp. Form.:
C23H28N8OS
Mol. Mass.:
464.586
SMILES:
CN1CCN(CC1)c1cc(Nc2cc(C)n[nH]2)nc(Sc2ccc(NC(=O)C3CC3)cc2)n1
:
Substrate
Name:
BDBM13531
Synonyms:
4-(4-Fluorophenyl)-2-(4-hydroxyphenyl)-5-(4-pyridyl)-1H-imidazole 4-[4-(4-fluorophenyl)-5-(4-pyridyl)-4-imidazolin-2-ylidene]cyclohexa-2,5-dien-1-one SB-202190 biotinylated SB202190
Type:
Small organic molecule
Emp. Form.:
C20H14FN3O
Mol. Mass.:
331.3431
SMILES:
Oc1ccc(cc1)-c1nc(c([nH]1)-c1ccc(F)cc1)-c1ccncc1
: