Target
P2Y purinoceptor 1
Ligand
BDBM261048
Substrate
Meas. Tech.
Scintillation Proximity Assay (SPA)
pH
7.4±n/a
Temperature
298.15±n/a K
Ki
1.20±n/a nM
Comments
extracted
Citation
 LHeureux, A 7-hydroxy-indolinyl antagonists of P2Y1 receptor US Patent  US9540323 Publication Date 1/10/2017 
Target
Name:
P2Y purinoceptor 1
Synonyms:
ATP receptor P2RY1_HUMAN P2Y1 Purinergic receptor P2Y1
Type:
Enzyme
Mol. Mass.:
42090.25
Organism:
Homo sapiens (Human)
Description:
P47900
Residue:
373
  
Inhibitor
Name:
BDBM261048
Synonyms:
US9540323, 269 | US9540323, example 269
Type:
Small organic molecule
Emp. Form.:
C24H18ClF4N5O3S
Mol. Mass.:
567.943
SMILES:
CC1(C)CN(c2c1c(-c1cc(no1)C(F)(F)F)c(F)cc2O)c1ccccc1NC(=O)Nc1csc(Cl)n1
: