Target
cAMP-dependent protein kinase catalytic subunit alpha [V123M,T183A]
Ligand
BDBM14029
Substrate
Kemptide
Meas. Tech.
Kinase Activity Assay
IC50
31000±n/a nM
Citation
 Bonn, SHerrero, SBreitenlechner, CBErlbruch, ALehmann, WEngh, RAGassel, MBossemeyer, D Structural analysis of protein kinase A mutants with Rho-kinase inhibitor specificity. J Biol Chem 281:24818-30 (2006)  
Target
Name:
cAMP-dependent protein kinase catalytic subunit alpha [V123M,T183A]
Synonyms:
KAPCA_BOVIN PRKACA cAMP-Dependent Protein Kinase (PKA) Mutant PKAR2 (3) | cAMP-dependent protein kinase, alpha-catalytic subunit
Type:
Enzyme Catalytic Subunit
Mol. Mass.:
40629.81
Organism:
Bos taurus (bovine)
Description:
P00517[V123M,T183A]
Residue:
351
  
Inhibitor
Name:
BDBM14029
Synonyms:
(R)-TRANS-4-(1-AMINOETHYL)-N-(4-PYRIDYL) CYCLOHEXANECARBOXAMIDE US10183931, Y-27632 | Y-27632
Type:
Small organic molecule
Emp. Form.:
C14H21N3O
Mol. Mass.:
247.336
SMILES:
[H][C@@]1(CC[C@@]([H])(CC1)C(=O)Nc1ccncc1)[C@@H](C)N
:
Substrate
Name:
Kemptide
Synonyms:
Aurora Peptide Substrate
Type:
Peptide
Mol. Mass.:
773.92
Organism:
Description:
50 uM ATP as co-substrate.
Residue:
7
LRRASLG