Target
CREB-binding protein
Ligand
BDBM340731
Substrate
Meas. Tech.
TR-FRET Binding Assay
IC50
3.00±n/a nM
Citation
 Adler, MAlbrecht, BKBronner, SChen, KXCôté, ACrawford, TCyr, PEgen, JKauder, SLai, KWLiao, JMagnuson, SMurray, JPastor, RRomero, FATaylor, AMTsui, VHWang, FZhu, B Therapeutic compounds and uses thereof US Patent  US9763922 Publication Date 9/19/2017 
Target
Name:
CREB-binding protein
Synonyms:
CBP CREB-binding protein (CBP) CREBBP
Type:
Transcription Coactivator
Mol. Mass.:
265411.66
Organism:
Homo sapiens (Human)
Description:
Q92793
Residue:
2442
  
Inhibitor
Name:
BDBM340731
Synonyms:
US9763922, Example 257
Type:
Small organic molecule
Emp. Form.:
C22H24F3N7O2
Mol. Mass.:
475.4669
SMILES:
Cn1cc(cn1)-c1cc(F)c(Nc2nn([C@H]3CCOC3)c3CCN(Cc23)C(N)=O)cc1C(F)F
: